Org.apache.spark.sparkexception job aborted due to stage failure

strange org.apache.spark.SparkException: Job aborted due to stage

Dec 11, 2017 · hello everyone I am working on PySpark Python and I have mentioned the code and getting some issue, I am wondering if someone knows about the following issue? windowSpec = Window.partitionBy(df['id']).orderBy(df_Broadcast['id']) windowSp... Mar 31, 2019 · org.apache.spark.SparkException: Job aborted due to stage failure: Task in stage failed,Lost task in stage : ExecutorLostFailure (executor 4 lost) Ask Question Asked 4 years, 5 months ago Jun 1, 2022 · Collectives™ on Stack Overflow – Centralized & trusted content around the technologies you use the most.

Did you know?

Jul 17, 2020 · Caused by: org.apache.spark.SparkException: Job aborted due to stage failure: Serialized task 2:0 was 155731289 bytes, which exceeds max allowed: spark.rpc.message.maxSize (134217728 bytes). Consider increasing spark.rpc.message.maxSize or using broadcast variables for large values. Apache Spark; koukou. ... org.apache.spark.SparkException: Job aborted due to stage failure: Task 0 in stage 30.0 failed 1 times, most recent failure: Lost task 0.0 ...2 Answers. df.toPandas () collects all data to the driver node, hence it is very expensive operation. Also there is a spark property called maxResultSize. spark.driver.maxResultSize (default 1G) --> Limit of total size of serialized results of all partitions for each Spark action (e.g. collect) in bytes. Should be at least 1M, or 0 for unlimited.Teams. Q&A for work. Connect and share knowledge within a single location that is structured and easy to search. Learn more about Teams: org.apache.spark.SparkException: Job aborted due to stage failure: Serialized task 302987:27 was 139041896 bytes, which exceeds max allowed: spark.akka.frameSize (134217728 bytes) - reserved (204800 bytes).Caused by: org.apache.spark.SparkException: Job aborted due to stage failure: Total size of serialized results of 478 tasks (2026.0 MB) is bigger than spark.driver.maxResultSize (1024.0 MB) 当然可以通过调大spark.driver.maxResultSize的默认配置来解决问题,但如果不能从源头上解决小文件问题,以后还可能遇到 ...org.apache.spark.SparkException: Job aborted due to stage failure: Task XXX in stage YYY failed 4 times, most recent failure: Lost task XXX in stage YYY (TID ZZZ, ip-xxx-xx-x-xxx.compute.internal, executor NNN): ExecutorLostFailure (executor NNN exited caused by one of the running tasks) Reason: ... 解決方法 理由コードの検索Teams. Q&A for work. Connect and share knowledge within a single location that is structured and easy to search. Learn more about TeamsJob aborted due to stage failure: ShuffleMapStage 20 (repartition at data_prep.scala:87) has failed the maximum allowable number of times: 4 2 Why does Spark fail with FetchFailed error?Jan 4, 2019 · Exception in thread "main" org.apache.spark.SparkException: Job aborted due to stage failure: Task 0 in stage 2.0 failed 1 times, most recent failure: Lost task 0.0 in stage 2.0 (TID 119, localhost, executor driver): ExecutorLostFailure (executor driver exited caused by one of the running tasks) Reason: Executor heartbeat timed out after 128839 ... org.apache.spark.SparkException: Job aborted due to stage failure: Task 1 in stage 188.0 failed 4 in Data Engineering a month ago; SparkException: There is no Credential Scope. in Data Governance a month ago>>Job aborted due to stage failure: Total size of serialized results of 19 tasks (4.2 GB) is bigger than spark.driver.maxResultSize (4.0 GB)'.. The exception was raised by the IDbCommand interface. Please take a look at following document about maxResultsize issue:Mar 31, 2019 · org.apache.spark.SparkException: Job aborted due to stage failure: Task in stage failed,Lost task in stage : ExecutorLostFailure (executor 4 lost) Ask Question Asked 4 years, 5 months ago org.apache.spark.shuffle.MetadataFetchFailedException: Missing an output location for shuffle 0 解决方法:这种问题一般发生在有大量shuffle操作的时候,task不断的failed,然后又重执行,一直循环下去,直到application失败。Feb 6, 2019 · I am new to PySpark. I have been writing my code with a test sample. Once I run the code on the larger file(3gb compressed). My code is only doing some filtering and joins. I keep getting errors Apr 9, 2021 · Viewed 8k times. 1. I am trying to do some computation using UDFs. But after the computation when i try to convert the pyspark dataframe to pandas it gives me org.apache.spark.SparkException: Exception thrown in awaitResult: I will put down the reproducible code. import pandas as pd import numpy as np import time n = 10000 sample_df = pd ... Nov 11, 2021 · 1 Answer. PySpark DF are lazy loading. When you call .show () you are asking the prior steps to execute and anyone of them may not work, you just can't see it until you call .show () because they haven't executed. I go back to earlier steps and call .collect () on each operation of the DF. This will at least allow you to isolate where the bad ... Sep 14, 2020 · Hi Team, I am writing a Delta file in ADL-Gen2 from ADF for multiple files dynamically using Dataflows activity. For the initial run i am able to read the file from Azure DataBricks . But when i rerun the pipeline with truncate and load i am getting… Jan 24, 2022 · 1 Answer. Sorted by: 1. You need to create an RDD of type RDD [Tuple [str]] but in your code, the line: rdd = spark.sparkContext.parallelize (comments) returns RDD [str] which then fails when you try to convert it to dataframe with that given schema. Try modifying that line to: 报错如下: : org.apache.spark.SparkException: Job aborted due to stage failure: Task 0 in stage 3.0 failed 4 times, most recent failure: ...

Feb 14, 2020 · Go into the cluster settings, under Advanced select spark and paste spark.driver.maxResultSize 0 (for unlimited) or whatever the value suits you. Using 0 is not recommended. You should optimize the job by re partitioning. For more details, refer "Spark Configurations - Application Properties". Hope this helps. Do let us know if you any further ... Sep 1, 2022 · one can solve this job aborted error, either changing the "spark configuration" in the cluster or either use "try_cast" function when you are getting this error while inserting data from one table to another table in databricks. use dbr version : 10.4 LTS (includes Apache Spark 3.2.1, Scala 2.12) org.apache.spark.SparkException: Job aborted due to stage failure: Task XXX in stage YYY failed 4 times, most recent failure: Lost task XXX in stage YYY (TID ZZZ, ip-xxx-xx-x-xxx.compute.internal, executor NNN): ExecutorLostFailure (executor NNN exited caused by one of the running tasks) Reason: ... 解決方法 理由コードの検索Sep 1, 2022 · use dbr version : 10.4 LTS (includes Apache Spark 3.2.1, Scala 2.12) for spark configuartion edit the spark tab by editing the cluster and use below code there. "spark.sql.ansi.enabled false"

Mar 30, 2020 · org.apache.spark.SparkException: Job aborted due to stage failure: Task 29 in stage 0.0 failed 4 times, most recent failure: Lost task 29.3 in stage 0.0 (TID 92, 10.252.252.125, executor 23): ExecutorLostFailure (executor 23 exited caused by one of the running tasks) Reason: Remote RPC client disassociated. org.apache.spark.SparkException: Job aborted due to stage failure: 8 Databricks Exception: Total size of serialized results is bigger than spark.driver.maxResultsSize…

Reader Q&A - also see RECOMMENDED ARTICLES & FAQs. Nov 28, 2019 · According to the content of README.m. Possible cause: Teams. Q&A for work. Connect and share knowledge within a single locat.

Check the Availability of Free RAM - whether it matches the expectation of the job being executed. Run below on each of the servers in the cluster and check how much RAM & Space they have in offer. free -h. If you are using any HDFS files in the Spark job , make sure to Specify & Correctly use the HDFS URL.Dec 11, 2017 · hello everyone I am working on PySpark Python and I have mentioned the code and getting some issue, I am wondering if someone knows about the following issue? windowSpec = Window.partitionBy(df['id']).orderBy(df_Broadcast['id']) windowSp...

Exception logs: 2018-08-26 16:15:02 INFO DAGScheduler:54 - ResultStage 0 (parquet at ReadDb2HDFS.scala:288) failed in 1008.933 s due to Job aborted due to stage failure: Task 0 in stage 0.0 failed 4 times, most recent failure: Lost task 0.3 in stage 0.0 (TID 3, master, executor 4): ExecutorLostFailure (executor 4 exited caused by one of the ...Jan 3, 2022 · Based on the code , am not seeing anything wrong . Still you can analysis this issue based on the following data related . Make sure 4th line lines rdd has the data based on the collect().

calling o110726.collectToPython. : org.apache.spar Teams. Q&A for work. Connect and share knowledge within a single location that is structured and easy to search. Learn more about Teams Go into the cluster settings, under Advanced sele2 Answers. df.toPandas () collects all data to the driver >>Job aborted due to stage failure: Total size of serialized results of 19 tasks (4.2 GB) is bigger than spark.driver.maxResultSize (4.0 GB)'.. The exception was raised by the IDbCommand interface. Please take a look at following document about maxResultsize issue: When a stage failure occurs, the Spark driver logs report an except FYI in Spark 2.4 a lot of you will probably encounter this issue. Kryo serialization has gotten better but in many cases you cannot use spark.kryo.unsafe=true or the naive kryo serializer. For a quick fix try changing the following in your Spark configuration spark.kryo.unsafe="false" OR. spark.serializer="org.apache.spark.serializer ...Problem Databricks throws an error when fitting a SparkML model or Pipeline: org.apache.spark.SparkException: Job aborted due to stage failure: Task 0 in s Job aborted due to stage failure: Task 5 in stage 3.0 failed 1Apr 9, 2021 · Viewed 8k times. 1. I am tryione can solve this job aborted error, either changing the "spar Go into the cluster settings, under Advanced select spark and paste spark.driver.maxResultSize 0 (for unlimited) or whatever the value suits you. Using 0 is not recommended. You should optimize the job by re partitioning. For more details, refer "Spark Configurations - Application Properties". Hope this helps. Do let us know if you any further ...I am trying to run a pyspark job but it is failing on RDD collectAndServe method. I do not have any memory issues. I have all updated jars in my jars folder. Python worker is crashing with below er... I am trying to run a pyspark job but it is failing on RDD co Jan 4, 2019 · Exception in thread "main" org.apache.spark.SparkException: Job aborted due to stage failure: Task 0 in stage 2.0 failed 1 times, most recent failure: Lost task 0.0 in stage 2.0 (TID 119, localhost, executor driver): ExecutorLostFailure (executor driver exited caused by one of the running tasks) Reason: Executor heartbeat timed out after 128839 ... org.apache.spark.SparkException: Job aborted due to s[If absolutely necessary you can set the property spark.driver.maxRFeb 14, 2020 · Go into the cluster settings, under Ad hello everyone I am working on PySpark Python and I have mentioned the code and getting some issue, I am wondering if someone knows about the following issue? windowSpec = Window.partitionBy(org.apache.spark.SparkException: Job aborted due to stage failure: 8 Databricks Exception: Total size of serialized results is bigger than spark.driver.maxResultsSize